associato a
type: ObjectProperty
comment: La relazione più generica nella rete di ontologie ISPRA.
comment: The most generic relation that can be used within the ISPRA ontonet. @en
label: associated with @en

al tempo
type: ObjectProperty
sub property of: associato a
inverse of: è tempo di
domain: Entità
range: Entità temporale
comment: La relazione esistente tra una qualsiasi entità ed un'entità temporale.
comment: The relation holding between an entity ad a temporal entity. @en
label: at time @en

classifica
type: ObjectProperty
sub property of: associato a
inverse of: è classificato da
domain: Concetto
range: Entità
comment: La proprietà utilizzata per affermare che un concetto classificava una certa entità.
comment: The property used to state that a concept classified a certain entity. @en
label: classifies @en

segue direttamente
type: ObjectProperty
sub property of: segue
inverse of: precede direttamente
domain: Entità
range: Entità
comment: L'intransitivo segue la relazione. Ad esempio, il martedì segue direttamente il lunedì. L'immediatezza della precedenza dipende dalla concettualizzazione del progettista.
comment: The intransitive follows relation. For example, Tuesday directly follows Monday. Directness of precedence depends on the designer conceptualization. @en
label: directly follows @en

precede direttamente
type: ObjectProperty
sub property of: precede
domain: Entità
range: Entità
comment: L'intransitivo precede la relazione. Ad esempio, il lunedì precede direttamente il martedì. L'immediatezza della precedenza dipende dalla concettualizzazione del progettista.
comment: The intransitive precedes relation. For example, Monday directly precedes Tuesday. Directness of precedence depends on the designer conceptualization. @en
label: directly precedes @en

segue
type: ObjectProperty
sub property of: associato a
inverse of: precede
type: TransitiveProperty
domain: Entità
range: Entità
comment: A relation between entities, expressing a 'sequence' schema. @en
comment: Una relazione tra entità, che esprime uno schema di 'sequenza'.
label: follows @en

ha ruolo-agente
type: ObjectProperty
sub property of: ha eventualità
inverse of: è ruolo-agente di
domain: Entità
range: AgentRole
comment: La relazione che permette di collegare un'entità alla relazione n-aria che rappresenta il ruolo ricoperto da un agente.
comment: The relationship that allows you to connect an entity to the n-aria relationship that represents the role played by an agent. @en
label: has agent-role @en

ha caratteristica
type: ObjectProperty
sub property of: associato a
inverse of: è caratteristica di
domain: Entità
range: Caratteristica
comment: La relazione di primo livello che intercorre tra un'entità e una delle sue caratteristiche.
comment: The top-level relation holding between an entity and one of its characteristics. @en
label: has characteristic @en

ha collezione
type: ObjectProperty
sub property of: associato a
inverse of: è collezione di
domain: Entità
range: Collezione
comment: La relazione esistente tra un'entità ed una collezione.
comment: The relation holding between an entity and a collection. @en
label: has collection @en

ha schema di dati
type: ObjectProperty
sub property of: ha descrizione
inverse of: è schema di dati di
domain: Media
range: Schema di dati.
comment: La relazione che sussiste tra un media e il suo schema di dati.
comment: The relation holding between a media and its data schema. @en
label: has data schema @en

ha descrizione
type: ObjectProperty
sub property of: associato a
inverse of: è descrizione di
domain: Entità
range: Descrizione
comment: Property that associates an entity with its description. @en
comment: Proprietà che associa un'entità alla sua descrizione.
label: has description @en

ha URL di scaricamento
type: ObjectProperty
sub property of: associato a
domain: Media
comment: Questo è un link diretto al file scaricabile in un dato formato. E.g. un file CSV o un file RDF. Il formato è descritto dal dct:format e/o dal dcat:mediaType della distribuzione.
comment: The URL of the downloadable file in a given format. E.g. CSV file or RDF file. The format is indicated by the distribution's dct:format and/or dcat:mediaType. @en
label: has download URL @en

ha eventualità
type: ObjectProperty
sub property of: associato a
inverse of: is eventuality of
domain: Entità
range: Accadimento
comment: La relazione esistente tra una qualsiasi entità ed una di tipo Eventualità.
comment: The relationship existing between any entity and another typed as Eventuality. @en
label: has eventuality @en

ha luogo
type: ObjectProperty
sub property of: associato a
inverse of: is location of
domain: Entità
range: Luogo
comment: La relazione esistente tra un qualsiasi tipo di entità ed un luogo.
comment: The relation holding between any kind of entity and a place. @en
label: has place @en

ha media
type: ObjectProperty
sub property of: associato a
inverse of: è media di
domain: Entità
range: Media
comment: La relazione tra un'entità ed un'istanza della classe Media.
comment: The relationship between an entity and an instance of the middle class. @en
label: has media @en

ha membro
type: ObjectProperty
sub property of: associato a
inverse of: è membro di
domain: Collezione
range: Entità
comment: La relazione di membership.
comment: The membership relation. @en
label: has member @en

ha parte
type: ObjectProperty
sub property of: associato a
inverse of: è parte di
type: TransitiveProperty
type: ReflexiveProperty
domain: Entità
range: Entità
comment: La relazione di parte definita come proprietà transitiva e riflessiva.
comment: The parthood relation defined as a transitive and reflexive property. @en
label: has part @en

ha il ruolo
type: ObjectProperty
sub property of: è classificato da
inverse of: è ruolo di
domain: Entità
range: Ruolo
property chain axiom: è l'agente coinvolto in
property chain axiom: coinvolge il ruolo
comment: La relazione che permette di classificare un'entità in base al ruolo che essa ricopre.
comment: The relationship that allows you to classify an entity based on the role it holds. @en
label: has role @en

ha attributo di schema di dati
type: ObjectProperty
sub property of: ha caratteristica
inverse of: è attributo di schema di dati di
domain: Schema di dati.
range: Attributo di schema di dati.
comment: La relazione che consente di associare uno schema di dati ai suoi attributi dello schema.
comment: The relation that allows one to associate a data schema with its schema attributes. @en
label: has data schema attribute @en

has system
type: ObjectProperty
sub property of: associato a
inverse of: è sistema di
domain: Entità
range: Sistema
comment: La relazione che sussiste tra una qualsiasi entità ed un sistema.
comment: The relation holding between any entity and a system. @en

ha identificativo univoco
type: ObjectProperty
sub property of: ha caratteristica
inverse of: è identificativo univoco di
domain: Entità
range: Identificativo univoco
comment: La relazione esistente tra un'entità e il suo identificatore univoco.
comment: The relation holding between an entity and its unique identifier. @en
label: has unique identifier @en

ha unità di misura
type: ObjectProperty
sub property of: ha caratteristica
inverse of: è unità di misura di
domain: Entità
range: Unità di misura
comment: Property that links an object that can be measured to its corresponding unit of measure. @en
comment: Proprietà che collega un oggetto misurabile alla sua unità di misura corrispondente.
label: has unit of measure @en

ha valore
type: ObjectProperty
sub property of: ha caratteristica
inverse of: è valore di
domain: Entità
range: Valore
comment: La relazione esistente tra un'entità ed il valore ad essa associata.
comment: The relationship between an entity and the value it is associated with. @en
label: has value @en

coinvolge l'agente
type: ObjectProperty
sub property of: is eventuality of
inverse of: è l'agente coinvolto in
domain: AgentRole
range: Agente
comment: La relazione che collega una situazione ruolo-agente a un agente coinvolto in tale situazione.
comment: The relationship that links an agent-role situation to an agent involved in such a situation. @en
label: involves agent @en

coinvolge il ruolo
type: ObjectProperty
sub property of: is eventuality of
inverse of: è il ruolo coinvolto in
domain: AgentRole
range: Ruolo
comment: La relazione che sussiste tra l'eventualità identificata da un ruolo-agente ed uno o più ruoli ad esso associata.
comment: The relation holding between an agent-role eventualoty and the one or more roles. @en
label: involves role @en

è l'agente coinvolto in
type: ObjectProperty
sub property of: ha eventualità
domain: Agente
range: AgentRole
comment: La relazione che lega un agente alla situazione ruolo-agente in cui è coinvolto.
comment: The relationship that links an agent to the agent-role situation it is involved in. @en
label: is agent involved in @en

è ruolo-agente di
type: ObjectProperty
sub property of: is eventuality of
domain: AgentRole
range: Entità
comment: La relazione che collega un ruolo-agente ad un'entità.
comment: The relation that links an agent-role to an entity. @en
label: is agent-role of @en

è caratteristica di
type: ObjectProperty
sub property of: associato a
domain: Caratteristica
range: Entità
comment: La relazione che collega una caratteristica all'entità a cui essa può essere associata.
comment: The relationship that links a characteristic to the entity it can be associated with. @en
label: is characteristic of @en

è classificato da
type: ObjectProperty
sub property of: associato a
domain: Entità
range: Concetto
comment: La proprietà per stabilire che un certo concetto viene usato per classificare una certa entità.
comment: The property to state that a certain concept is used to classify a certain entity. @en
label: is classified by @en

è collezione di
type: ObjectProperty
sub property of: associato a
domain: Collezione
range: Entità
comment: La relazione esistente tra una collezione ed una qualsiasi entità.
comment: The relation holding between a collection and any possible entity. @en
label: is collection of @en

è schema di dati di
type: ObjectProperty
sub property of: è descrizione di
domain: Schema di dati.
range: Media
comment: La relazione esistente tra uno schema di dati e il supporto.
comment: The relation existing between a data schema and the media. @en
label: is data schema of @en

è descrizione di
type: ObjectProperty
sub property of: associato a
domain: Descrizione
range: Entità
comment: La relazione esistente tra una descrizione e l'entità descritta.
comment: The relationship between a description and the entity described. @en
label: is description of @en

is eventuality of
type: ObjectProperty
sub property of: associato a
domain: Accadimento
range: Entità
comment: Il rapporto esistente tra un'eventualità e qualsiasi entità possibile.
comment: The relationship existing between an eventuality and any possible entity. @en
label: è eventualità di

ha creatore
type: ObjectProperty
sub property of: associato a
inverse of: è creatore di
domain: Entità
range: Agente
comment: La relazione che consente di affermare che un'entità è creata da un determinato agente.
comment: The relation that allows one to state that an entity is created by a given agent. @en
label: has creator @en

is location of
type: ObjectProperty
sub property of: associato a
domain: Luogo
range: Entità
comment: La proprietà che permette di dire che un determinato luogo è la posizione di un dato oggetto.
comment: La relazione esistente tra un luogo ed un'entità di un qualsiasi tipo.
comment: The property that allows to say that a certain place is the location of a given object. @en
comment: The relation holding between a place and an entity of any possible type. @en
label: is place of @en
label: è luogo di

è media di
type: ObjectProperty
sub property of: associato a
domain: Media
range: Entità
comment: La relazione tra un'istanza di un'entità di classe Media e un'entità.
comment: The relationship between an instance Media class entity and an entity. @en
label: is media of @en

è membro di
type: ObjectProperty
sub property of: associato a
domain: Entità
range: Collezione
comment: La relazione inversa di 'ha membro'. Come la sua inversa permette di stabilire relazione di memberhip tra un elemento ed la sua collezione.
comment: The inverse relation of 'has member'. It allows to represent membership relations. @en
label: is member of @en

è parametrizzato da
type: ObjectProperty
sub property of: è classificato da
inverse of: parametrizza
domain: Entità
range: Parametro
comment: La relazione che sussiste tra l'entità oggetto della parametrizzazione ed il parametro.
comment: The relation holding between the entity being object of the parametrisation and a parameter. @en
label: is parametrised by @en

è parte di
type: ObjectProperty
sub property of: associato a
type: TransitiveProperty
type: ReflexiveProperty
domain: Entità
range: Entità
comment: L'inversa di 'ha parte' per rappresentare la relazione di parte dal punto di vista della parte. La proprietà è definita come riflessiva e transitiva.
comment: The inverse of 'has part' for representing parthood from the perspective of the part. The property is defined as reflexive and transitive. @en
label: is part of @en

è il ruolo coinvolto in
type: ObjectProperty
sub property of: ha eventualità
domain: Ruolo
range: AgentRole
comment: La relazione che collega un ruolo alla situazione ruolo-agente in cui esso partecipa.
comment: The relationship that links a role to the agent-role situation it is involved in. @en
label: is role involved in @en

è ruolo di
type: ObjectProperty
sub property of: classifica
domain: Ruolo
range: Entità
property chain axiom: è il ruolo coinvolto in
property chain axiom: coinvolge l'agente
comment: La relazione che consente di utilizzare un ruolo per classificare una determinata entità.
comment: The relation that allows you to use a role for classifying a certain entity. @en
label: is role of @en

La relazione tra una descrizione ed un'eventualità.
type: ObjectProperty
sub property of: associato a
inverse of: soddisfa
domain: Descrizione
range: Accadimento
label: The relation between a description and an eventuality. @en
label: is satisfied by @en
label: è soddisfatto da

è attributo di schema di dati di
type: ObjectProperty
sub property of: è caratteristica di
domain: Attributo di schema di dati.
range: Schema di dati.
comment: La proprietà che permette di collegare un attributo allo schema di dati.
comment: The property that allows you to link an attribute to the data schema. @en
label: is data schema attribute of @en

è specializzato da
type: ObjectProperty
sub property of: associato a
inverse of: specializza
type: TransitiveProperty
domain: Entità
range: Entità
comment: La relazione inverse di 'specializza'.
comment: The inverse releation of 'specialises' @en
label: is specialised by @en

è sistema di
type: ObjectProperty
sub property of: associato a
domain: Sistema
range: Entità
comment: La relazione che sussiste tra un sistema ed una qualsiasi entità.
comment: The relationship holding between a system and any entity. @en
label: is system of @en

è tempo di
type: ObjectProperty
sub property of: associato a
domain: Entità temporale
range: Entità
comment: La relazione esistente tra un'entità temporale ed una qualsiasi altra entità.
comment: The relationship existing between a time entity and any other entity. @en
label: is time of @en

è identificativo univoco di
type: ObjectProperty
sub property of: è caratteristica di
comment: La relazione che sussiste tra un identificatore univoco e l'entità che identifica. @en
comment: The relation holding between a unique identifier and the entity it identifies. @en
label: is unique identifier of @en

è unità di misura di
type: ObjectProperty
sub property of: è caratteristica di
domain: Unità di misura
range: Entità
comment: Property that links a unit of measure to the object or measured value. @en
comment: Proprietà che collega un'unità di misura all'oggetto o al valore misurato.
label: is unit of measure of @en

è valore di
type: ObjectProperty
sub property of: è caratteristica di
domain: Valore
range: Entità
comment: La relazione esistente tra un valore ed un'entità a cui tale valore è associato.
comment: The relationship between a value and an entity to which that value is associated. @en
label: is value of @en

è creatore di
type: ObjectProperty
sub property of: associato a
domain: Agente
range: Entità
comment: La relazione che consente di affermare che un determinato agente è il creatore di una certa entità.
comment: The property that allows us to state that a certain agent is the creator of a certain entity. @en
label: is creator of @en

parametrizza
type: ObjectProperty
sub property of: classifica
domain: Parametro
range: Entità
comment: La relazione che sussiste tra un parametro e l'entità oggetto della parametrizzazione.
comment: The relation holding between a parameter and the entity being object of the parametrisation. @en
label: parametrises @en

precede
type: ObjectProperty
sub property of: associato a
type: TransitiveProperty
domain: Entità
range: Entità
comment: A relation between entities, expressing a 'sequence' schema. @en
comment: Una relazione tra entità, che esprime uno schema di 'sequenza'.
label: precedes @en

soddisfa
type: ObjectProperty
sub property of: associato a
domain: Accadimento
range: Descrizione
comment: La proprietà usata per asserire che un'eventualità soddisfa una certa descrizione.
comment: The property for asserting that an eventuality satisfies a description. @en
label: satisfies @en

specializza
type: ObjectProperty
sub property of: associato a
type: TransitiveProperty
domain: Entità
range: Entità
comment: La proprietà per esprimere relazioni di specializzazione.
comment: The property for expressing specialisation relations. @en
label: specialises @en

acronimo
type: DatatypeProperty
domain: Entità
range: Literal
comment: A value for the acronym that is used for referring to an entity. @en
comment: Un valore per l'acronimo utilizzato per fare riferimento a un'entità.
label: acronym @en

identificativo
type: DatatypeProperty
comment: Il valore letterale di un identificativo, ex. il codice WMO '6100218'.
comment: The literal value of an identifier, e.g. the WMO code '6100218'. @en
label: identifier @en

tipo di supporto
type: DatatypeProperty
domain: Media
range: Literal
comment: A value for the media type, e.g. text/csv, rdf/xml, etc. @en
comment: Un valore per il tipo di supporto, ad es. text/csv, rdf/xml, ecc.
label: media type @en

nome
type: DatatypeProperty
domain: Entità
range: Literal
comment: Il letterale che rappresenta il nome di un'entità.
comment: The literal representing the name of an entity. @en
label: name @en

data e ora
type: DatatypeProperty
domain: Entità
range: dateTime
comment: La proprietà per associare la rappresentazione letterale del tempo a un'entità. La rappresentazione letterale deve essere un xsd:dateTime valido.
comment: The property for associating the literal representation of time to an entity. The literal representation has to be a valid xsd:dateTime. @en
label: date time @en

valore
type: DatatypeProperty
domain: Entità
range: Literal
comment: La rappresentazione letterale di un valore.
comment: The literal representation of a value. @en
label: value @en

Agente
type: Class
subclass of: Entità
comment: Il concetto astratto di agente. Esempi di agente sono le persone e le organizzazioni.
comment: The abstract concept of agent. Examples of agents are people and organisations.
label: Agent @en

Caratteristica
type: Class
subclass of: Entità
comment: La classe delle caratteristiche, intese come aspetti, attributi o qualità di un'entità. Ex. una quantità, qualità estetica, colore, etc.
comment: The class of characteristics, intended as any aspect, attribuite, or quality of an entity. E.g. a certain size, aesthetic quality, color, etc. @en
label: Characteristic @en

Collezione
type: Class
subclass of: Entità
subclass of: Restriction
  on property: ha parte
  all values from: Collezione
comment: La classe per rappresentare collezioni che rendono possibile l'aggregazione di oggetti.
comment: The class for representing collections and aggregating objects into collections. @en
label: Collection @en

Concetto
type: Class
subclass of: Entità
comment: It is an object that is defined in some description. Once defined it can be used in other descriptions @en
comment: È un oggetto che è definito in qualche descrizione. Una volta definito può essere utilizzato in altre descrizioni
label: Concept @en

Schema di dati.
type: Class
subclass of: Descrizione
subclass of: Restriction
  on property: ha attributo di schema di dati
  some values from: Attributo di schema di dati.
subclass of: Restriction
  on property: ha attributo di schema di dati
  all values from: Attributo di schema di dati.
comment: La classe per la rappresentazione di schemi di dati.
comment: The class for representing data schemata. @en
label: Data schema @en

Descrizione
type: Class
subclass of: Entità
disjoint with: Accadimento
comment: La classe degli oggetti costruiti socialmente (testi, valori, categorie, relazioni, contesti) usati per descrivere qualcos'altro in modo structuratto. Gli esempi includono i piani (come descrizioni strutturate di azioni da eseguire ex. in un processo industriale), le diagnosi (come descrizioni strutturate di situazioni osservate ex. clinicamente), le spiegazioni (come testi strutturati per chiarire ex. un concetto in un sistema normativo), osservazioni oggettive (come insiemi di valori strutturati che identificano una situazione rilevante ex. da un sistema di sensori).
comment: The class of socially-created objects (texts, values, categories, relations, contexts) used to describe something else in a structured way. Examples include plans (as structured descriptions of actions to be executed), diagnoses (as structured descriptions of observed situations, explanations (as structured texts clarifying e.g. a concept), objective observations (as structured sets of values that identify a relevant situation). @en
label: Description @en

Entità
type: Class
comment: La classe più generica in ISPRA ontonet.
comment: The top level class of ISPRA ontonet. @en
label: Entity @en

Accadimento
type: Class
subclass of: Entità
comment: Any event, situation, activity, event type, etc. Used to abstract from formal criteria that distinguish between event occurrences, their types, and constructed objects (situations, tropes, qua-entities) that provide a setting for multiple entities. This is a catch all class to make sense of ambiguous data that cannot be made more precise, e.g. at the lexical level. This is the same concept as defined in http://www.ontologydesignpatterns.org/ont/d0.owl. @en
comment: Qualsiasi evento, situazione, attività, tipo di evento, ecc. Utilizzato per astrarre da criteri formali che distinguono tra occorrenze di eventi, i loro tipi e oggetti costruiti (situazioni, tropi, qua-entità) che forniscono un'ambientazione per più entità. Questa è una classe catch all per dare un senso a dati ambigui che non possono essere resi più precisi, ad es. a livello lessicale. Questo è lo stesso concetto definito in http://www.ontologydesignpatterns.org/ont/d0.owl.
label: Eventuality @en

Luogo
type: Class
subclass of: Entità
comment: Il concetto più generico per rappresentare ad alto livello qualsiasi tipo di oggetto che possa essere identificato come luogo.
comment: The most generic concept for any kind of location. @en
label: Place @en

Media
type: Class
subclass of: Entità
subclass of: Restriction
  on property: ha schema di dati
  qualified cardinality: 1
  on class: Schema di dati.
subclass of: Restriction
  on property: ha URL di scaricamento
  cardinality: 1
subclass of: Restriction
  on property: tipo di supporto
  cardinality: 1
comment: Any media encoding data in any format. @en
comment: Qualsiasi supporto che codifica i dati in qualsiasi formato.

Organizzazione
type: Class
subclass of: Agente
disjoint with: Persona
comment: An organisation. @en
comment: Un'organizzazione.
label: Organisation @en

Parametro
type: Class
subclass of: Caratteristica
subclass of: Concetto
comment: A paramater. @en
comment: Qualsiasi entità che rappresenti un parametro.
label: Parameter @en

Persona
type: Class
subclass of: Agente
comment: A person @en
comment: Una persona.
label: Person @en

Ruolo
type: Class
subclass of: Concetto
comment: La classe per rappresentare i ruoli.
comment: The class for representing roles. @en
label: Role @en

Attributo di schema di dati.
type: Class
subclass of: Caratteristica
subclass of: Restriction
  on property: è classificato da
  some values from: Concetto
comment: A single attribute of a data schema. @en
comment: Un singolo attributo di uno schema di dati.
label: Data schema attribute @en

Sistema
type: Class
subclass of: Entità
comment: Any possible kind of system. @en
comment: Ogni possibile tipo di sistema.
label: System @en

Entità temporale
type: Class
subclass of: Entità
subclass of: Restriction
  on property: data e ora
  some values from: dateTime
subclass of: Restriction
  on property: data e ora
  all values from: dateTime
comment: Questa classe rappresenta qualsiasi tipo di entità temporale, ad es. intervalli di tempo, mesi, giorni, ecc...
comment: This class represents a temporal entity. @en
label: Temporal entity @en

Identificativo univoco
type: Class
subclass of: Caratteristica
subclass of: Restriction
  on property: ha creatore
  some values from: Organizzazione
subclass of: Restriction
  on property: ha creatore
  all values from: Organizzazione
subclass of: Restriction
  on property: identificativo
  cardinality: 1
has key: ha creatore
has key: identificativo
comment: La classe per rappresentare identificativi univoci, e.g. codice WMO, codice ISTAT, ecc...
comment: The class to represent unique identifiers, eg. WMO code, ISTAT code, etc. @en
label: Unique identifier @en

Unità di misura
type: Class
subclass of: Parametro
comment: Questa classe viene utilizzata per modellare un'unità di misura, ad es. metro, chilometro, grammo, ecc...
comment: This class is used to model a measurement unit, e.g. meter, kilometer, gram, etc. @en
label: Unit of measure @en

Valore
type: Class
subclass of: Caratteristica
subclass of: Restriction
  on property: ha unità di misura
  max qualified cardinality: 1
  on class: Unità di misura
subclass of: Restriction
  on property: valore
  cardinality: 1
has key: ha unità di misura
has key: valore
comment: La classe dei valori. Il valore è descritto con un unico valore come un intero, un float, una stringa (ne deve essere specificata almeno una) e, quando disponibile, un'unità di misura.
comment: The class of the values. The value is described with a single value such an integer, a float, a string (at least one has to be specified) and, when available, a unit of measurement. @en
label: Value @en